[squid-dev] Build failed in Jenkins: trunk-matrix » clang,j-fbsd-93 #703

noc at squid-cache.org noc at squid-cache.org
Mon Jul 25 10:45:55 UTC 2016


See <http://build.squid-cache.org/job/trunk-matrix/compiler=clang,label=j-fbsd-93/703/>

------------------------------------------
[...truncated 5365 lines...]
============================================================================
Making check in snmp
make  
make  check-TESTS
/bin/sh ../../../../test-suite/testheaders.sh "ccache clang++35 -I/usr/local/include/c++/v1 -L/usr/local/clang-abi/lib -L/usr/local/lib -stdlib=libc++ -DHAVE_CONFIG_H    -I../../../.. -I../../../../include  -I../../../../lib -I../../../../src  -I../../include -I/usr/local/include -I/usr/include  -I/usr/include  -I../../../../libltdl  -Werror -Qunused-arguments  -D_REENTRANT -g -O2 -std=c++11 -I/usr/local/include"  || exit 1
PASS: testHeaders
============================================================================
Testsuite summary for Squid Web Proxy 4.0.12-BZR
============================================================================
# TOTAL: 1
# PASS:  1
# SKIP:  0
# XFAIL: 0
# FAIL:  0
# XPASS: 0
# ERROR: 0
============================================================================
Making check in adaptation
Making check in icap
make  
make  check-TESTS
/bin/sh ../../../../../test-suite/testheaders.sh "ccache clang++35 -I/usr/local/include/c++/v1 -L/usr/local/clang-abi/lib -L/usr/local/lib -stdlib=libc++ -DHAVE_CONFIG_H    -I../../../../.. -I../../../../../include  -I../../../../../lib -I../../../../../src  -I../../../include -I/usr/local/include -I/usr/include  -I/usr/include  -I../../../../../libltdl  -Werror -Qunused-arguments  -D_REENTRANT -g -O2 -std=c++11 -I/usr/local/include"  || exit 1
PASS: testHeaders
============================================================================
Testsuite summary for Squid Web Proxy 4.0.12-BZR
============================================================================
# TOTAL: 1
# PASS:  1
# SKIP:  0
# XFAIL: 0
# FAIL:  0
# XPASS: 0
# ERROR: 0
============================================================================
make  
Making all in icap
make  check-TESTS
/bin/sh ../../../../test-suite/testheaders.sh "ccache clang++35 -I/usr/local/include/c++/v1 -L/usr/local/clang-abi/lib -L/usr/local/lib -stdlib=libc++ -DHAVE_CONFIG_H    -I../../../.. -I../../../../include  -I../../../../lib -I../../../../src  -I../../include -I/usr/local/include -I/usr/include  -I/usr/include  -I../../../../libltdl  -Werror -Qunused-arguments  -D_REENTRANT -g -O2 -std=c++11 -I/usr/local/include"  || exit 1
PASS: testHeaders
============================================================================
Testsuite summary for Squid Web Proxy 4.0.12-BZR
============================================================================
# TOTAL: 1
# PASS:  1
# SKIP:  0
# XFAIL: 0
# FAIL:  0
# XPASS: 0
# ERROR: 0
============================================================================
make  tests/testACLMaxUserIP tests/testBoilerplate  tests/testCacheManager  tests/testCharacterSet tests/testDiskIO  tests/testDns tests/testEnumIterator  tests/testEvent tests/testEventLoop  tests/test_http_range tests/testTokenizer  tests/testHttp1Parser tests/testHttpReply  tests/testHttpRequest tests/testIcmp  tests/testIpAddress tests/testStore  tests/testString tests/testURL  tests/testSBuf tests/testSBufList  tests/testConfigParser tests/testStatHist  tests/testLookupTable tests/testYesNoNone  tests/testRock tests/testUfs testRefCount
cp ../../../test-suite/test_tools.cc .
depbase=`echo tests/stub_cbdata.o | sed 's|[^/]*$|.deps/&|;s|\.o$||'`; ccache clang++35 -I/usr/local/include/c++/v1 -L/usr/local/clang-abi/lib -L/usr/local/lib -stdlib=libc++ -DHAVE_CONFIG_H -DDEFAULT_CONFIG_FILE=\"/usr<http://build.squid-cache.org/job/trunk-matrix/compiler=clang,label=j-fbsd-93/ws/btlayer-00-default/squid-4.0.12-BZR/_inst/etc/squid.conf\">  -DDEFAULT_SQUID_DATA_DIR=\"/usr<http://build.squid-cache.org/job/trunk-matrix/compiler=clang,label=j-fbsd-93/ws/btlayer-00-default/squid-4.0.12-BZR/_inst/share\">  -DDEFAULT_SQUID_CONFIG_DIR=\"/usr<http://build.squid-cache.org/job/trunk-matrix/compiler=clang,label=j-fbsd-93/ws/btlayer-00-default/squid-4.0.12-BZR/_inst/etc\">    -I../../.. -I../../../include  -I../../../lib -I../../../src  -I../include -I/usr/local/include -I/usr/include  -I/usr/include  -I../../../libltdl -I../src -I../../../libltdl  -I/usr/include  -I/usr/include  -Werror -Qunused-arguments  -D_REENTRANT -g -O2 -std=c++11 -I/usr/local/include -MT tests/stub_cbdata.o -MD -MP -MF $depbase.Tpo -c -o tests/stub_cbdata.o ../../../src/tests/stub_cbdata.cc && mv -f $depbase.Tpo $depbase.Po
depbase=`echo tests/stub_debug.o | sed 's|[^/]*$|.deps/&|;s|\.o$||'`; ccache clang++35 -I/usr/local/include/c++/v1 -L/usr/local/clang-abi/lib -L/usr/local/lib -stdlib=libc++ -DHAVE_CONFIG_H -DDEFAULT_CONFIG_FILE=\"/usr<http://build.squid-cache.org/job/trunk-matrix/compiler=clang,label=j-fbsd-93/ws/btlayer-00-default/squid-4.0.12-BZR/_inst/etc/squid.conf\">  -DDEFAULT_SQUID_DATA_DIR=\"/usr<http://build.squid-cache.org/job/trunk-matrix/compiler=clang,label=j-fbsd-93/ws/btlayer-00-default/squid-4.0.12-BZR/_inst/share\">  -DDEFAULT_SQUID_CONFIG_DIR=\"/usr<http://build.squid-cache.org/job/trunk-matrix/compiler=clang,label=j-fbsd-93/ws/btlayer-00-default/squid-4.0.12-BZR/_inst/etc\">    -I../../.. -I../../../include  -I../../../lib -I../../../src  -I../include -I/usr/local/include -I/usr/include  -I/usr/include  -I../../../libltdl -I../src -I../../../libltdl  -I/usr/include  -I/usr/include  -Werror -Qunused-arguments  -D_REENTRANT -g -O2 -std=c++11 -I/usr/local/include -MT tests/stub_debug.o -MD -MP -MF $depbase.Tpo -c -o tests/stub_debug.o ../../../src/tests/stub_debug.cc && mv -f $depbase.Tpo $depbase.Po
depbase=`echo tests/stub_libmem.o | sed 's|[^/]*$|.deps/&|;s|\.o$||'`; ccache clang++35 -I/usr/local/include/c++/v1 -L/usr/local/clang-abi/lib -L/usr/local/lib -stdlib=libc++ -DHAVE_CONFIG_H -DDEFAULT_CONFIG_FILE=\"/usr<http://build.squid-cache.org/job/trunk-matrix/compiler=clang,label=j-fbsd-93/ws/btlayer-00-default/squid-4.0.12-BZR/_inst/etc/squid.conf\">  -DDEFAULT_SQUID_DATA_DIR=\"/usr<http://build.squid-cache.org/job/trunk-matrix/compiler=clang,label=j-fbsd-93/ws/btlayer-00-default/squid-4.0.12-BZR/_inst/share\">  -DDEFAULT_SQUID_CONFIG_DIR=\"/usr<http://build.squid-cache.org/job/trunk-matrix/compiler=clang,label=j-fbsd-93/ws/btlayer-00-default/squid-4.0.12-BZR/_inst/etc\">    -I../../.. -I../../../include  -I../../../lib -I../../../src  -I../include -I/usr/local/include -I/usr/include  -I/usr/include  -I../../../libltdl -I../src -I../../../libltdl  -I/usr/include  -I/usr/include  -Werror -Qunused-arguments  -D_REENTRANT -g -O2 -std=c++11 -I/usr/local/include -MT tests/stub_libmem.o -MD -MP -MF $depbase.Tpo -c -o tests/stub_libmem.o ../../../src/tests/stub_libmem.cc && mv -f $depbase.Tpo $depbase.Po
depbase=`echo tests/stub_MemBuf.o | sed 's|[^/]*$|.deps/&|;s|\.o$||'`; ccache clang++35 -I/usr/local/include/c++/v1 -L/usr/local/clang-abi/lib -L/usr/local/lib -stdlib=libc++ -DHAVE_CONFIG_H -DDEFAULT_CONFIG_FILE=\"/usr<http://build.squid-cache.org/job/trunk-matrix/compiler=clang,label=j-fbsd-93/ws/btlayer-00-default/squid-4.0.12-BZR/_inst/etc/squid.conf\">  -DDEFAULT_SQUID_DATA_DIR=\"/usr<http://build.squid-cache.org/job/trunk-matrix/compiler=clang,label=j-fbsd-93/ws/btlayer-00-default/squid-4.0.12-BZR/_inst/share\">  -DDEFAULT_SQUID_CONFIG_DIR=\"/usr<http://build.squid-cache.org/job/trunk-matrix/compiler=clang,label=j-fbsd-93/ws/btlayer-00-default/squid-4.0.12-BZR/_inst/etc\">    -I../../.. -I../../../include  -I../../../lib -I../../../src  -I../include -I/usr/local/include -I/usr/include  -I/usr/include  -I../../../libltdl -I../src -I../../../libltdl  -I/usr/include  -I/usr/include  -Werror -Qunused-arguments  -D_REENTRANT -g -O2 -std=c++11 -I/usr/local/include -MT tests/stub_MemBuf.o -MD -MP -MF $depbase.Tpo -c -o tests/stub_MemBuf.o ../../../src/tests/stub_MemBuf.cc && mv -f $depbase.Tpo $depbase.Po
depbase=`echo tests/testRefCount.o | sed 's|[^/]*$|.deps/&|;s|\.o$||'`; ccache clang++35 -I/usr/local/include/c++/v1 -L/usr/local/clang-abi/lib -L/usr/local/lib -stdlib=libc++ -DHAVE_CONFIG_H -DDEFAULT_CONFIG_FILE=\"/usr<http://build.squid-cache.org/job/trunk-matrix/compiler=clang,label=j-fbsd-93/ws/btlayer-00-default/squid-4.0.12-BZR/_inst/etc/squid.conf\">  -DDEFAULT_SQUID_DATA_DIR=\"/usr<http://build.squid-cache.org/job/trunk-matrix/compiler=clang,label=j-fbsd-93/ws/btlayer-00-default/squid-4.0.12-BZR/_inst/share\">  -DDEFAULT_SQUID_CONFIG_DIR=\"/usr<http://build.squid-cache.org/job/trunk-matrix/compiler=clang,label=j-fbsd-93/ws/btlayer-00-default/squid-4.0.12-BZR/_inst/etc\">    -I../../.. -I../../../include  -I../../../lib -I../../../src  -I../include -I/usr/local/include -I/usr/include  -I/usr/include  -I../../../libltdl -I../src -I../../../libltdl  -I/usr/include  -I/usr/include  -Werror -Qunused-arguments  -D_REENTRANT -g -O2 -std=c++11 -I/usr/local/include -MT tests/testRefCount.o -MD -MP -MF $depbase.Tpo -c -o tests/testRefCount.o ../../../src/tests/testRefCount.cc && mv -f $depbase.Tpo $depbase.Po
depbase=`echo tests/stub_CollapsedForwarding.o | sed 's|[^/]*$|.deps/&|;s|\.o$||'`; ccache clang++35 -I/usr/local/include/c++/v1 -L/usr/local/clang-abi/lib -L/usr/local/lib -stdlib=libc++ -DHAVE_CONFIG_H -DDEFAULT_CONFIG_FILE=\"/usr<http://build.squid-cache.org/job/trunk-matrix/compiler=clang,label=j-fbsd-93/ws/btlayer-00-default/squid-4.0.12-BZR/_inst/etc/squid.conf\">  -DDEFAULT_SQUID_DATA_DIR=\"/usr<http://build.squid-cache.org/job/trunk-matrix/compiler=clang,label=j-fbsd-93/ws/btlayer-00-default/squid-4.0.12-BZR/_inst/share\">  -DDEFAULT_SQUID_CONFIG_DIR=\"/usr<http://build.squid-cache.org/job/trunk-matrix/compiler=clang,label=j-fbsd-93/ws/btlayer-00-default/squid-4.0.12-BZR/_inst/etc\">    -I../../.. -I../../../include  -I../../../lib -I../../../src  -I../include -I/usr/local/include -I/usr/include  -I/usr/include  -I../../../libltdl -I../src -I../../../libltdl  -I/usr/include  -I/usr/include  -Werror -Qunused-arguments  -D_REENTRANT -g -O2 -std=c++11 -I/usr/local/include -MT tests/stub_CollapsedForwarding.o -MD -MP -MF $depbase.Tpo -c -o tests/stub_CollapsedForwarding.o ../../../src/tests/stub_CollapsedForwarding.cc && mv -f $depbase.Tpo $depbase.Po
depbase=`echo tests/stub_ETag.o | sed 's|[^/]*$|.deps/&|;s|\.o$||'`; ccache clang++35 -I/usr/local/include/c++/v1 -L/usr/local/clang-abi/lib -L/usr/local/lib -stdlib=libc++ -DHAVE_CONFIG_H -DDEFAULT_CONFIG_FILE=\"/usr<http://build.squid-cache.org/job/trunk-matrix/compiler=clang,label=j-fbsd-93/ws/btlayer-00-default/squid-4.0.12-BZR/_inst/etc/squid.conf\">  -DDEFAULT_SQUID_DATA_DIR=\"/usr<http://build.squid-cache.org/job/trunk-matrix/compiler=clang,label=j-fbsd-93/ws/btlayer-00-default/squid-4.0.12-BZR/_inst/share\">  -DDEFAULT_SQUID_CONFIG_DIR=\"/usr<http://build.squid-cache.org/job/trunk-matrix/compiler=clang,label=j-fbsd-93/ws/btlayer-00-default/squid-4.0.12-BZR/_inst/etc\">    -I../../.. -I../../../include  -I../../../lib -I../../../src  -I../include -I/usr/local/include -I/usr/include  -I/usr/include  -I../../../libltdl -I../src -I../../../libltdl  -I/usr/include  -I/usr/include  -Werror -Qunused-arguments  -D_REENTRANT -g -O2 -std=c++11 -I/usr/local/include -MT tests/stub_ETag.o -MD -MP -MF $depbase.Tpo -c -o tests/stub_ETag.o ../../../src/tests/stub_ETag.cc && mv -f $depbase.Tpo $depbase.Po
depbase=`echo tests/stub_fatal.o | sed 's|[^/]*$|.deps/&|;s|\.o$||'`; ccache clang++35 -I/usr/local/include/c++/v1 -L/usr/local/clang-abi/lib -L/usr/local/lib -stdlib=libc++ -DHAVE_CONFIG_H -DDEFAULT_CONFIG_FILE=\"/usr<http://build.squid-cache.org/job/trunk-matrix/compiler=clang,label=j-fbsd-93/ws/btlayer-00-default/squid-4.0.12-BZR/_inst/etc/squid.conf\">  -DDEFAULT_SQUID_DATA_DIR=\"/usr<http://build.squid-cache.org/job/trunk-matrix/compiler=clang,label=j-fbsd-93/ws/btlayer-00-default/squid-4.0.12-BZR/_inst/share\">  -DDEFAULT_SQUID_CONFIG_DIR=\"/usr<http://build.squid-cache.org/job/trunk-matrix/compiler=clang,label=j-fbsd-93/ws/btlayer-00-default/squid-4.0.12-BZR/_inst/etc\">    -I../../.. -I../../../include  -I../../../lib -I../../../src  -I../include -I/usr/local/include -I/usr/include  -I/usr/include  -I../../../libltdl -I../src -I../../../libltdl  -I/usr/include  -I/usr/include  -Werror -Qunused-arguments  -D_REENTRANT -g -O2 -std=c++11 -I/usr/local/include -MT tests/stub_fatal.o -MD -MP -MF $depbase.Tpo -c -o tests/stub_fatal.o ../../../src/tests/stub_fatal.cc && mv -f $depbase.Tpo $depbase.Po
depbase=`echo tests/stub_libsecurity.o | sed 's|[^/]*$|.deps/&|;s|\.o$||'`; ccache clang++35 -I/usr/local/include/c++/v1 -L/usr/local/clang-abi/lib -L/usr/local/lib -stdlib=libc++ -DHAVE_CONFIG_H -DDEFAULT_CONFIG_FILE=\"/usr<http://build.squid-cache.org/job/trunk-matrix/compiler=clang,label=j-fbsd-93/ws/btlayer-00-default/squid-4.0.12-BZR/_inst/etc/squid.conf\">  -DDEFAULT_SQUID_DATA_DIR=\"/usr<http://build.squid-cache.org/job/trunk-matrix/compiler=clang,label=j-fbsd-93/ws/btlayer-00-default/squid-4.0.12-BZR/_inst/share\">  -DDEFAULT_SQUID_CONFIG_DIR=\"/usr<http://build.squid-cache.org/job/trunk-matrix/compiler=clang,label=j-fbsd-93/ws/btlayer-00-default/squid-4.0.12-BZR/_inst/etc\">    -I../../.. -I../../../include  -I../../../lib -I../../../src  -I../include -I/usr/local/include -I/usr/include  -I/usr/include  -I../../../libltdl -I../src -I../../../libltdl  -I/usr/include  -I/usr/include  -Werror -Qunused-arguments  -D_REENTRANT -g -O2 -std=c++11 -I/usr/local/include -MT tests/stub_libsecurity.o -MD -MP -MF $depbase.Tpo -c -o tests/stub_libsecurity.o ../../../src/tests/stub_libsecurity.cc && mv -f $depbase.Tpo $depbase.Po
depbase=`echo tests/stub_StatHist.o | sed 's|[^/]*$|.deps/&|;s|\.o$||'`; ccache clang++35 -I/usr/local/include/c++/v1 -L/usr/local/clang-abi/lib -L/usr/local/lib -stdlib=libc++ -DHAVE_CONFIG_H -DDEFAULT_CONFIG_FILE=\"/usr<http://build.squid-cache.org/job/trunk-matrix/compiler=clang,label=j-fbsd-93/ws/btlayer-00-default/squid-4.0.12-BZR/_inst/etc/squid.conf\">  -DDEFAULT_SQUID_DATA_DIR=\"/usr<http://build.squid-cache.org/job/trunk-matrix/compiler=clang,label=j-fbsd-93/ws/btlayer-00-default/squid-4.0.12-BZR/_inst/share\">  -DDEFAULT_SQUID_CONFIG_DIR=\"/usr<http://build.squid-cache.org/job/trunk-matrix/compiler=clang,label=j-fbsd-93/ws/btlayer-00-default/squid-4.0.12-BZR/_inst/etc\">    -I../../.. -I../../../include  -I../../../lib -I../../../src  -I../include -I/usr/local/include -I/usr/include  -I/usr/include  -I../../../libltdl -I../src -I../../../libltdl  -I/usr/include  -I/usr/include  -Werror -Qunused-arguments  -D_REENTRANT -g -O2 -std=c++11 -I/usr/local/include -MT tests/stub_StatHist.o -MD -MP -MF $depbase.Tpo -c -o tests/stub_StatHist.o ../../../src/tests/stub_StatHist.cc && mv -f $depbase.Tpo $depbase.Po
../../../src/tests/stub_MemBuf.cc:25:13: error: out-of-line definition of 'isNull' does not match any declaration in 'MemBuf'
int MemBuf::isNull() { { std::cerr<<"FATAL: "<<("MemBuf.cc" " required")<<" for use of "<<__FUNCTION__<<"\n"; exit(1); }; return 1; }
            ^~~~~~
../../../src/MemBuf.h:102:9: note: member declaration does not match because it is const qualified
    int isNull() const;
        ^        ~~~~~
1 error generated.
*** [tests/stub_MemBuf.o] Error code 1
1 error
*** [check-am] Error code 2
1 error
*** [check-recursive] Error code 1
1 error
*** [check] Error code 2
1 error
*** [check-recursive] Error code 1
1 error
*** [distcheck] Error code 1
1 error
buildtest.sh result is 2
BUILD: .././test-suite/buildtests/layer-00-default.opts
configure: BUILD LIBRARIES: 
configure: BUILD EXTRA LIBRARIES: -lm
configure: BUILD OBJECTS: 
configure: BUILD EXTRA OBJECTS: 
configure: BUILD C FLAGS: -g -O2 -I/usr/local/include
configure: BUILD EXTRA C FLAGS:  -Werror -Qunused-arguments  -D_REENTRANT
configure: BUILD C++ FLAGS: -g -O2 -std=c++11 -I/usr/local/include
configure: BUILD EXTRA C++ FLAGS:  -Werror -Qunused-arguments  -D_REENTRANT
configure: BUILD Tools C++ FLAGS:  -g -O2 -std=c++11 -I/usr/local/include
configure: BUILD LIBRARIES: 
configure: BUILD EXTRA LIBRARIES: -lm
configure: BUILD OBJECTS: 
configure: BUILD EXTRA OBJECTS: 
configure: BUILD C FLAGS: -g -O2 -I/usr/local/include
configure: BUILD EXTRA C FLAGS:  -Werror -Qunused-arguments  -D_REENTRANT
configure: BUILD C++ FLAGS: -g -O2 -std=c++11 -I/usr/local/include
configure: BUILD EXTRA C++ FLAGS:  -Werror -Qunused-arguments  -D_REENTRANT
configure: BUILD Tools C++ FLAGS:  -g -O2 -std=c++11 -I/usr/local/include
# XFAIL: 0
# FAIL:  0
# XFAIL: 0
# FAIL:  0
# XFAIL: 0
# FAIL:  0
# XFAIL: 0
# FAIL:  0
# XFAIL: 0
# FAIL:  0
# XFAIL: 0
# FAIL:  0
# XFAIL: 0
# FAIL:  0
# XFAIL: 0
# FAIL:  0
# XFAIL: 0
# FAIL:  0
# XFAIL: 0
# FAIL:  0
# XFAIL: 0
# FAIL:  0
# XFAIL: 0
# FAIL:  0
# XFAIL: 0
# FAIL:  0
# XFAIL: 0
# FAIL:  0
# XFAIL: 0
# FAIL:  0
# XFAIL: 0
# FAIL:  0
# XFAIL: 0
# FAIL:  0
# XFAIL: 0
# FAIL:  0
# XFAIL: 0
# FAIL:  0
# XFAIL: 0
# FAIL:  0
# XFAIL: 0
# FAIL:  0
# XFAIL: 0
# FAIL:  0
# XFAIL: 0
# FAIL:  0
# XFAIL: 0
# FAIL:  0
# XFAIL: 0
# FAIL:  0
# XFAIL: 0
# FAIL:  0
# XFAIL: 0
# FAIL:  0
# XFAIL: 0
# FAIL:  0
# XFAIL: 0
# FAIL:  0
# XFAIL: 0
# FAIL:  0
# XFAIL: 0
# FAIL:  0
# XFAIL: 0
# FAIL:  0
# XFAIL: 0
# FAIL:  0
# XFAIL: 0
# FAIL:  0
# XFAIL: 0
# FAIL:  0
# XFAIL: 0
# FAIL:  0
# XFAIL: 0
# FAIL:  0
# XFAIL: 0
# FAIL:  0
# XFAIL: 0
# FAIL:  0
# XFAIL: 0
# FAIL:  0
# XFAIL: 0
# FAIL:  0
# XFAIL: 0
# FAIL:  0
# XFAIL: 0
# FAIL:  0
# XFAIL: 0
# FAIL:  0
# XFAIL: 0
# FAIL:  0
# XFAIL: 0
# FAIL:  0
# XFAIL: 0
# FAIL:  0
# XFAIL: 0
# FAIL:  0
# XFAIL: 0
# FAIL:  0
# XFAIL: 0
# FAIL:  0
# XFAIL: 0
# FAIL:  0
# XFAIL: 0
# FAIL:  0
# XFAIL: 0
# FAIL:  0
# XFAIL: 0
# FAIL:  0
# XFAIL: 0
# FAIL:  0
# XFAIL: 0
# FAIL:  0
# XFAIL: 0
# FAIL:  0
# XFAIL: 0
# FAIL:  0
# XFAIL: 0
# FAIL:  0
# XFAIL: 0
# FAIL:  0
# XFAIL: 0
# FAIL:  0
# XFAIL: 0
# FAIL:  0
# XFAIL: 0
# FAIL:  0
# XFAIL: 0
# FAIL:  0
# XFAIL: 0
# FAIL:  0
# XFAIL: 0
# FAIL:  0
# XFAIL: 0
# FAIL:  0
# XFAIL: 0
# FAIL:  0
# XFAIL: 0
# FAIL:  0
../../../src/tests/stub_MemBuf.cc:25:13: error: out-of-line definition of 'isNull' does not match any declaration in 'MemBuf'
*** [tests/stub_MemBuf.o] Error code 1
*** [check-am] Error code 2
*** [check-recursive] Error code 1
*** [check] Error code 2
*** [check-recursive] Error code 1
*** [distcheck] Error code 1
Build FAILED.
Build step 'Execute shell' marked build as failure
[description-setter] Description set: 


More information about the squid-dev mailing list